Home > C Compiler > Arch C Compiler Cannot Create Executables

Arch C Compiler Cannot Create Executables

Contents

So it was pretty clear this way the issue. COLLECT_GCC_OPTIONS='-v' '-march=native' '-o' 'x' /usr/local/libexec/gcc/i686-pc-linux-gnu/4.7.3/cc1 -quiet -v hello.c -march=core2 [...] The ruby-2.1.1 configure script does use -march, but only to detect an atomic builtin (__sync_val_compare_and_swap), it never gets that far anyway. Now, without any option in the configure, the problem is always the same. You need to check it. have a peek at this web-site

i686-pc-linux-gnu checking for a BSD-compatible install... /usr/bin/install -c checking whether build environment is sane... x86_64-unknown-linux-gnu checking target system type... I've also run makepkg as root. Why cast an A-lister for Groot?

Configure: Error: C Compiler Cannot Create Executables Mac

How to replace inner text with yanked text What do ^$ and ^# mean? Browse other questions tagged ubuntu ruby gcc or ask your own question. more stack exchange communities company blog Stack Exchange Inbox Reputation and Badges sign up log in tour help Tour Start here for a quick overview of the site Help Center Detailed done Writing bin/root-config ...

In my case I fixed the problem installing python by selecting Xcode 7.3.1 –Marco Pelegrini Jun 30 at 17:59 add a comment| up vote 138 down vote I have 10.8 installed You are probably missing that package. Making a large file using the terminal Am I interrupting my husband's parenting? Checking For C Compiler Default Output File Name RootTalk ROOT Discussion Forums Skip to content Search Advanced search Quick links Unread posts Unanswered posts Active topics Search The team FAQ Login Register Board index ROOT ROOT Support Search C

Do you have gcc installed? Configure Error C Compiler Cannot Create Executables Ubuntu Why cast an A-lister for Groot? no Checking for libjvm ... ok Checking whether to build xrootd ...

I used "xcode-select --install" and it worked perfectly. –Blairg23 Jul 9 '14 at 19:23 This seems to fix the issue on Yosemite; even though XCode 6 now comes with Checking Whether The C Compiler Works... No Mac yes Checking whether to build libMathMore ... My recommendation is to make sure the latest C headers are installed and then run your ./configure command. no Checking for ApMon.h ...

Configure Error C Compiler Cannot Create Executables Ubuntu

no Checking for libpq-fe.h ... http://stackoverflow.com/questions/10357804/configure-error-c-compiler-cannot-create-executables Am I interrupting my husband's parenting? Configure: Error: C Compiler Cannot Create Executables Mac no Checking for libfftw3, or libfftw3-3 ... Configure: Error: C Compiler Cannot Create Executables Centos Moderator: rootdev Post Reply Search Advanced search First unread post • 8 posts • Page 1 of 1 manso Posts: 9 Joined: Tue Oct 21, 2008 18:44 C compiler cannot create

Bug52007 - configure: error: installation or configuration problem: C compiler cannot create executables Summary: configure: error: installation or configuration problem: C compiler cannot cr... Check This Out no Checking for libglite-api-wrapper ... Were the Smurfs the first to smurf their smurfs? Anyone know what it is? Checking Whether The C Compiler Works... No

Especially when it becomes group-compiling because the OP has not a clue of what he is doing (having one, would require actual reding and understanding)... How to deal with a coworker that writes software to give him job security instead of solving problems? There is NO warranty; not even for MERCHANTABILITY or FITNESS FOR A PARTICULAR PURPOSE. Source Looking for a nice example for normal subgroups more hot questions about us tour help blog chat data legal privacy policy work here advertising info mobile contact us feedback Technology Life

mmcmonsterMay 14th, 2006, 09:15 PMI just noticed the same thing myself. $ ./configure checking for a BSD-compatible install... /usr/bin/install -c checking whether build environment is sane... Install A 32 Bit Compiler Toolchain The answer by steroscott fixed my issue a while back...this time around not the case. no Checking for libshift, shiftmd, or shift ...

no Checking for libpathplan, or pathplan ...

Not the answer you're looking for? no Checking whether to build libUnuran ... Instead I had: /Applications/Xcode.app/Contents/Developer/Toolchains/XcodeDefault.xctoolchain The C compiler ("cc") is located inside of that xctoolchain directory. Configure: Error: C++ Compiler Cannot Create Executables Ubuntu Am I interrupting my husband's parenting?

no checking for gcc option to accept ISO C89... It was created by hearts configure 0.1, which was generated by GNU Autoconf 2.59. Lesson learned: use a proper text editor... have a peek here collect2: error: ld returned 1 exit status0gcc is unable to create an executable file, compiling ffmpeg as static binary Hot Network Questions iptables not dropping by IP and port?

but I must $ sudo apt-get remove build-essential then $ sudo apt-get install build-essential Powered by vBulletin Version 4.2.2 Copyright © 2016 vBulletin Solutions, Inc. Browse other questions tagged linux-mint gcc wine or ask your own question. Which movie series are referenced in XKCD comic 1568? Remedies Build for a 64 bit target (by removing the configure options forcing a 32 bit build), or Install a 32 bit compiler toolchain share|improve this answer edited Jul 24 '14

On Debian based systems you can install essential tools and libraries by running: sudo apt-get install build-essential In addition to that, you need various dependencies and complicated set up regarding Win32/Win64 yum install gcc should cure it (but to build gcc you'll need some other packages too, like gmp-devel, mpfr-devel etc.). gcc is reporting its version as 4.0.1. The make and make install commands also completed successfully.

You can find the recommended way for Ubuntu. This is free software; see the source for copying conditions. configure:3311: $? = 4 configure:3331: checking whether the C compiler works configure:3353: gcc conftest.c >&5 /usr/bin/ld: cannot find crt1.o: No such file or directory /usr/bin/ld: cannot find crti.o: No such file no Checking for pwauth.h ...

ArrĂȘt. configure:2806: $? = 0 configure:2813: gcc -v >&5 Using built-in specs.