Home > C Compiler > C Compiler Cannot Create Executables Apache

C Compiler Cannot Create Executables Apache

Contents

I have done the below steps but gettting the error "checking whether the C compiler works... In a company crossing multiple timezones, is it rude to send a co-worker a work email in the middle of the night? x86_64-apple-darwin12.4.0 checking for gcc-4.2... It was created by configure, which was generated by GNU Autoconf 2.69. his comment is here

x86_64-apple-darwin13.3.0checking host system type... If something changed I can check but not sure what/how you referring to specifically.Hmmm as for tmp dir, all I have is in /etc/yaourtrc "TMPDIR="/tmp" and no probs so far with Apache checking for working mkdir -p... no" "configure: error: C compiler cannot create executables" [In reply to] On Mar 19, 2014, at 11:14 AM, ayaskanta.praharaj [at] wipro wrote: > ... > checking whether the C compiler works...

Configure: Error: C Compiler Cannot Create Executables Linux

Check your CFLAGS and CC environment variables, echo CFLAGS=$CFLAGS echo CC=$CC the output of gcc -dumpmachine gcc -v One possibility is a suspect specs file overriding the compiler defaults, so run q says: June 14, 2015 at 11:18 am Thanks for the pointer to the SO article-it got me around the "checking whether the C compiler works… no" error. How can I prove its value? How do I sort files into a sub-folder based on filename part?

This calls cpuid and other possibly restricted instructions (any chance your VM has some additional security features in place?) I'm not familiar with any changes that the "Ubuntua/Linaro" gcc may have Input: cd Downloads/wine-1.6.2 ./configure Output: checking build system type... I see the last entry as "target_vendor='unknown'" but there is no clear mention that anything is wrong with C compiler. Configure: Error: C Compiler Cannot Create Executables Centos share|improve this answer answered Jul 18 '15 at 0:02 yaegashi 6,0161221 add a comment| up vote 0 down vote You could have unrecognized CFLAGS set.

Also, double check what your $PATH is set to.Did this happen after a recent upgrade? Configure: Error: C Compiler Cannot Create Executables Mac If you need to reset your password, click here. no configure: error: in `/tmp/yaourt-tmp-srivo/abs-gdm/src/gdm-2.32.0': configure: error: C compiler cannot create executables See `config.log' for more details Abandon...I tryed to build this one with yaourt -Sb but the same happen when http://unix.stackexchange.com/questions/216856/c-compiler-cannot-create-executables Apache checking for working mkdir -p...

Why did the best potions master have greasy hair? Checking For C Compiler Default Output File Name Is adding the ‘tbl’ prefix to table names really a problem? Does a key signature go before or after a bar line? Anyway, this is just an alternate solution.

Configure: Error: C Compiler Cannot Create Executables Mac

none needed checking how to run the C preprocessor... /Applications/Xcode.app/Contents/Developer/Toolchains/OSX10.8.xctoolchain/usr/bin/cc -E checking for /Applications/Xcode.app/Contents/Developer/Toolchains/OSX10.8.xctoolchain/usr/bin/cc option to accept ISO C99... https://bbs.archlinux.org/viewtopic.php?id=108615 How can I declare sovereignty from the American government and start my own micro nation? Configure: Error: C Compiler Cannot Create Executables Linux My manager said I spend too much time on Stack Exchange. Configure Error C Compiler Cannot Create Executables Ubuntu Click here for instructions on how to enable JavaScript in your browser.

configure failed for srclib/apr redsnapperke View Public Profile View LQ Blog View Review Entries View HCL Entries Find More Posts by redsnapperke 05-29-2006, 10:40 AM #8 timmeke Senior Member this content configure:4417: $? = 4 configure:4421: checking whether we are using the GNU C++ compiler configure:4440: g++ -c conftest.cpp >&5 g++: error: missing argument to '-march=' configure:4440: $? = 1 configure: failed Unix & Linux Stack Exchange works best with JavaScript enabled current community chat Unix & Linux Unix & Linux Meta your communities Sign up or log in to customize your list. How to make plots 'blacker'? Checking Whether The C Compiler Works... No Mac

You signed in with another tab or window. On Debian based systems you can install essential tools and libraries by running: sudo apt-get install build-essential In addition to that, you need various dependencies and complicated set up regarding Win32/Win64 The company accepts no liability for any damage caused by any virus transmitted by this email. http://cmptp.com/c-compiler/c-compiler-cannot-create-executables-on-mac.html The old version was probably missing something for gcc or glibc.

downloaded apr-1.5.0.tar.gz, apr-util-1.5.3.tar.gz and extracted them into /u03/backup/Apps_stage/apache/http-2.4.9.tar.gz/srclib/ 3. See `config.log' For More Details x86_64-unknown-linux-gnu checking target system type... Please notify the sender immediately and destroy all copies of this message and any attachments.

configure:3820: $? = 4 configure:3809: gcc -qversion >&5 gcc: error: missing argument to '-march=' gcc: error: unrecognized command line option '-qversion' gcc: fatal error: no input files compilation terminated.

Also, for those that use port over brew, sudo port install apple-gcc42 works as well (except on Yosemite or later, but there's an open issue on that). Why is this C++ code faster than my hand-written assembly for testing the Collatz conjecture? x86_64-apple-darwin13.3.0 checking target system type... Configure: Exit 77 Sign in to comment Contact GitHub API Training Shop Blog About © 2016 GitHub, Inc.

The existing apache 2.2.15 was compiled with m32 flag. There is NO warranty; not even for MERCHANTABILITY or FITNESS FOR A PARTICULAR PURPOSE. Can you suggest why it fails ? check over here If you are not the intended recipient, you should not disseminate, distribute or copy this e-mail.

android. Note that registered members see fewer ads, and ContentLink is completely disabled once you log in. I'm not sure why @AlphaZygma inserted the new paths between some of the existing paths in /etc/paths. configure:3311: $? = 4 configure:3300: gcc -qversion >&5 gcc: error: unrecognized command line option '-qversion' gcc: fatal error: no input files compilation terminated.

x86_64-apple-darwin13.3.0 checking host system type... configure: configuring package in srclib/apr now checking build system type... To someone, it may be better than you dare to think.Blog Offline #3 2010-10-27 13:17:44 srivo Member From: Canada Registered: 2009-10-17 Posts: 60 Re: [Solved] error: C compiler cannot create executable Better yet, install the build-essential package.

The real goal of configure is not to find a directory but to find the pesky cc file. and still the same thing. x86_64-unknown-linux-gnu configure: configure: Configuring Apache Portable Runtime library... As a result, the configure script can't locate the directory OSX10.10.xctoolchain in the path that it is using to find the cc file.

cc clang ... ... First Skills to Learn for Mountaineering Is it safe to use cheap USB data cables?