Home > C Compiler > C Compiler Cannot Create Executables Archlinux

C Compiler Cannot Create Executables Archlinux


configure.log is what i need to get to the root of the problem. Indice Staff • Cancella cookie • Tutti gli orari sono UTC + 1 ora [ ora legale ] Powered by phpBB Forum Software © phpBB Group • Traduzione Italiana phpBBItalia.net basata Password Linux From Scratch This Forum is for the discussion of LFS. share|improve this answer edited Sep 18 '13 at 13:00 answered Sep 18 '13 at 12:54 Josh Uzo 4621613 8 It would be interesting to know why GCC didn't work. –Some his comment is here

Personal Open source Business Explore Sign up Sign in Pricing Blog Support Search GitHub This repository Watch 117 Star 817 Fork 433 appunite/AndroidFFmpeg Code Issues 47 Pull requests 1 Projects use --with-baseruby option.; false' BTESTRUBY='' BUILTIN_ENCOBJS='' BUILTIN_TRANSOBJS='' BUILTIN_TRANSSRCS='' CAPITARGET='' CC='gcc' CCDLFLAGS='' CC_VERSION='' CFLAGS='-march=native -mtune=native' CHDIR='' COMMON_HEADERS='' COMMON_LIBS='' COMMON_MACROS='' COUTFLAG='' CP='' CPP='/lib/cpp' CPPFLAGS='' CPPOUTFILE='' CROSS_COMPILING='' CXX='g++' CXXFLAGS='' DEFS='' DLDFLAGS='' DLDLIBS='' DLEXT2='' DLEXT='' i686-pc-linux-gnu checking host system type... no checking for mawk... https://bbs.archlinux.org/viewtopic.php?id=108615

C Compiler Cannot Create Executables Mac

I tried the: ./configure DFLAGS="-O3" command but with no effect. Singular cohomology and birational equivalence Why was Susan treated so unkindly? It was created by cpuminer configure 2.4.2, which was generated by GNU Autoconf 2.69. no checking for aCC...

That's easy enough to see from these lines Code: ../gcc-4.6.2/configure: line 4243: -gcc: command not found As you are on pass 2 of gcc, I suspect the problem is you don't yes checking how to create a ustar tar archive... Make sure it is completely removed from your pacman.conf. Install A 32 Bit Compiler Toolchain Why don't we use the étale definition of sheaves in Algebraic Geometry How to use namedpipe as temporary file?

Having a problem logging in? C Compiler Cannot Create Executables Linux The make and make install commands also completed successfully. So, you should run, as given in the README: ./configure CFLAGS="-O3" share|improve this answer answered Jul 12 '15 at 18:52 muru 70.7k12127179 add a comment| up vote 2 down vote Looks http://askubuntu.com/questions/647583/how-to-fix-configure-error-c-compiler-cannot-create-executables Is it acceptable to ask an unknown professor for help in a related field during his office hours?

yes checking for arm-linux-strip... /home/administrator/AndroidNDK/toolchains/arm-linux-androideabi-4.4.3/prebuilt/linux-x86/bin/arm-linux-androideabi-strip checking for a thread-safe mkdir -p... /bin/mkdir -p checking for gawk... C Compiler Cannot Create Executables Cross Compile Main Menu LQ Calendar LQ Rules LQ Sitemap Site FAQ View New Posts View Latest Posts Zero Reply Threads LQ Wiki Most Wanted Jeremy's Blog Report LQ Bug Syndicate Latest White ring of pus forming around branches Is "she don't" sometimes considered correct form? configure:4201: $? = 1 configure: failed program was: | /* confdefs.h */ | #define PACKAGE_NAME "" | #define PACKAGE_TARNAME "" | #define PACKAGE_VERSION "" | #define PACKAGE_STRING "" | #define PACKAGE_BUGREPORT

C Compiler Cannot Create Executables Linux

checking whether we are cross compiling... no configure: error: in `/tmp/yaourt-tmp-bobby/aur-freetype2-infinality/src/freetype-2.4.3/builds/unix': configure: error: C compiler cannot create executables See `config.log' for more details. C Compiler Cannot Create Executables Mac Determine maximum frequency of input signal to make system LTI My manager said I spend too much time on Stack Exchange. C Compiler Cannot Create Executables Ubuntu i686-pc-linux-gnu checking target system type...

If you cannot run that, then I concur with Michael Hampton, something is very badly broken. this content Sign in to comment Contact GitHub API Training Shop Blog About © 2016 GitHub, Inc. Thanks for the quick and simple reply; that fixed it. my build_android.sh: #!/bin/bash # # build_android.sh # Copyright (c) 2012 Jacek Marchwicki # # Licensed under the Apache License, Version 2.0 (the "License"); # you may not use this file except C Compiler Cannot Create Executables Centos

If you need to reset your password, click here. what was I going to say again? too QuickBrownFoxy commented May 12, 2013 I've fixed it. http://cmptp.com/c-compiler/c-compiler-cannot-create-executables-on-mac.html asked 2 years ago viewed 78144 times active 2 years ago Related 4error while compiling ffmpeg: gcc is unable to create an executable file3Linux cannot compile without GCC optimizations; implications?0C compiler

How can I prove its value? Checking Whether The C Compiler Works... No Mac Word for "using technology inappropriately"? LinuxQuestions.org > Forums > Linux Forums > Linux - Distributions > Linux From Scratch [SOLVED] GCC-4.6.2 configure: error: C compiler cannot create executables User Name Remember Me?

there are something like: export CC="${CROSS_COMPILE}gcc --sysroot=$PLATFORM" you need to fix your gcc path: export CC="${CROSS_COMPILE}gcc-4.4.3 --sysroot=$PLATFORM" probably NM,STRIP etc.

gnutar checking whether make supports nested variables... and still the same thing. There is NO warranty; not even for MERCHANTABILITY or FITNESS FOR A PARTICULAR PURPOSE. Configure: Exit 77 One Very Odd Email Which movie series are referenced in XKCD comic 1568?

I am trying to build Ruby from source as describe here: https://www.ruby-lang.org/en/installation/#building-from-source Here what i am getting: [email protected]:~/ruby-2.1.1$ ./configure checking build system type... I did not run into this the first time around. Add comments to a python script and make it a bilingual python/C++ “program” Can one bake a cake with a cooked egg instead of a raw one? check over here Changing compiler is, I think, just sidestepping the actual issue. –Some programmer dude Sep 19 '13 at 7:58 add a comment| 3 Answers 3 active oldest votes up vote 13 down

This is free software; see the source for copying conditions. x86_64-unknown-linux-gnu checking for gcc... GNU checking for arm-linux-gcc... /home/administrator/AndroidNDK/toolchains/arm-linux-androideabi-4.4.3/prebuilt/linux-x86/bin/arm-linux-androideabi-gcc --sysroot=/home/administrator/AndroidNDK/platforms/android-5/arch-arm/ checking whether the C compiler works... no checking for cl.exe...

So maybe you could have a look there. no checking whether we are using the GNU C++ compiler... i686-pc-linux-gnu checking target system type... It was created by configure, which was generated by GNU Autoconf 2.67.

Testing your ability to compile 32 bit objects You can test this by compiling a small C example with the -m32 flag. // Minimal C example #include int main() { Tank-Fighting Alien What should I do when the boss "pulls rank" to get their problems solved over our customers' problems? While running config.nice taken from apache2.2.15/build I am getting following error: checking whether the C compiler works... Remedies Build for a 64 bit target (by removing the configure options forcing a 32 bit build), or Install a 32 bit compiler toolchain share|improve this answer edited Jul 24 '14

z o.o. i686-pc-linux-gnu checking for gcc...gcc checking whether the C compiler works... This is free software: you are free to change and redistribute it. configure:3820: $? = 4 configure:3809: gcc -qversion >&5 gcc: error: missing argument to '-march=' gcc: error: unrecognized command line option '-qversion' gcc: fatal error: no input files compilation terminated.

Because my python is installed in a customized location, I had to temporarily set the LDFLAGS variable env. If something changed I can check but not sure what/how you referring to specifically.Hmmm as for tmp dir, all I have is in /etc/yaourtrc "TMPDIR="/tmp" and no probs so far with This calls cpuid and other possibly restricted instructions (any chance your VM has some additional security features in place?) I'm not familiar with any changes that the "Ubuntua/Linaro" gcc may have