Home > C Compiler > C Compiler Cannot Create Executables In Aix

C Compiler Cannot Create Executables In Aix

configure: error: in `/usr/net-snmp-5.6.1.1/net-snmp-5.6.1.1': configure: error: C compiler cannot create executables See `config.log' for more details. * I got following o/p in config.log' : *configure:5835: checking whether the Perl function system() Top This thread has been closed due to inactivity. Is it still the first hit off Google for this error message. Note that registered members see fewer ads, and ContentLink is completely disabled once you log in. his comment is here

Can you cd into powerpc-ibm-aix5.1.0.0/ppc64/libiberty/ (in your build directory) and create the following file conftest.c: #include "confdefs.h" main(){return(0);} and then run this command: /software/gcc-3.3-obj/gcc/xgcc -B/software/gcc-3.3-obj/gcc/ -B/u sr/local/powerpc-ibm-aix5.1.0.0/bin/ -B/usr/local/powerpc-ibm-aix5.1.0.0/lib/ -i system /usr/local/powerpc-ibm-aix5.1.0.0/include none checking for gcc... Please reopen this issue on ruby-build project and provide the info you've given us here. ­čĹŹ 1 mislav closed this Sep 1, 2013 sskylar commented Nov 5, 2013 Others coming yes checking for a thread-safe mkdir -p... /bin/mkdir -p checking for gawk... https://www.ibm.com/developerworks/forums/thread.jspa?messageID=14512984

Comment 14 David Edelsohn 2003-05-29 01:34:37 UTC Subject: Re: C compiler cannot create executables What is /usr/local/powerpc-ibm-aix5.1.0.0/bin/as ? configure: error: in `/home/learner/builds/tuxmath/src/tuxmath_w_fonts-1.7.2': configure: error: C compiler cannot create executables See `config.log' for more details. ==> ERROR: Build Failed. The native as and ld still are recommended. eepeesalimep replied Feb 15, 2012 May I know which app you are trying to configure ??

There is NO warranty; not even for MERCHANTABILITY or FITNESS FOR A PARTICULAR PURPOSE. Andrew Cowan replied Feb 14, 2012 Avinashe, Compiling in AIX can be a nightmare, fortunately this site has most of the answers: http://www.perzl.org/aix/index.php?n=Main.Instruct ions Good luck, Andrew Top Best Answer 0 Code: apt-get build-essential solved this issue for me. Solutions?

no checking for xlC... How can I declare sovereignty from the American government and start my own micro nation? gawk checking whether make sets $(MAKE)... navigate to these guys Stop.

x86_64-apple-darwin12.4.0 checking for gcc-4.2... The native @command{as} and @command{ld} are recommended for bootstrapping ! Why are password boxes always blanked out when other sensitive data isn't? eepeesalimep replied Feb 15, 2012 Try to find the location you installed compiler.

The GNU Assembler ! http://unix.ittoolbox.com/groups/technical-functional/ibm-aix-l/error-no-acceptable-c-compiler-found-in-path-4645656 I was then able to install ruby from source! Blogs Recent Entries Best Entries Best Blogs Blog List Search Blogs Home Forums HCL Reviews Tutorials Articles Register Search Search Forums Advanced Search Search Tags Search LQ Wiki Search Tutorials/Articles Search no.

Assembler and Linker do not support AIX 5L sufficiently to bootstrap GCC. ! this content Singular cohomology and birational equivalence Does every interesting photograph have a story to tell? All RSS Forum Timezone: UTC 0 Most Users Ever Online: 30Currently Online: 4 Guest(s)Currently Browsing this Page: 2 Guest(s) Top Posters: Member Stats: Guest Posters: 0Members: 0Moderators: 0Admins: 1 Forum Stats: something more problem in my case was the first "_UNIX", which is invalid parameter for compiler.

Wenn Sie nicht der richtige Adressat sind oder diese E-Mail irrt├╝mlich erhalten haben, informieren Sie bitte sofort den Absender und vernichten Sie diese Mail. c apache shell gcc compiler-construction share|improve this question edited Apr 8 '14 at 6:46 asked Apr 8 '14 at 6:23 Dark Matter 70631022 You should include the config.log in Is it safe to use cheap USB data cables? http://cmptp.com/c-compiler/c-compiler-cannot-create-executables-on-mac.html I hope this helps. /software/gcc-3.3-obj/powerpc-ibm-aix5.1.0.0/ppc64/libiberty> file conftest.o conftest.o: 64-bit XCOFF executable or object module not stripped -- Diese E-Mail enth├Ąlt vertrauliche und/oder rechtlich gesch├╝tzte Informationen.

I'm on mac OS 10.8 I opened xcode to see that the command line tool was not installed, so I installed it and I updated my rbenv and ruby-build using homebrew Reload to refresh your session. Das unerlaubte Kopieren sowie die unbefugte Weitergabe dieser Mail ist nicht gestattet.

no configure: error: in `/stud/config/usr/admin/gaara/httpd-2.4.9/srclib/apr': configure: error: C compiler cannot create executables See `config.log' for more details configure failed for srclib/apr and the config.log is also attached below.

Visit the following links: Site Howto | Site FAQ | Sitemap | Register Now If you have any problems with the registration process or your account login, please contact us. This runtime environment is not the same as the actual compiler software which you are looking for. I use KDevelop for unix (c++ dev tool). I think at this point Comment 11 Dara Hazeghi 2003-05-27 07:32:27 UTC David, sorry to bother you.

saavyone 270003CRE8 1 Post Re: Broken gcc compiler ‏2010-08-20T08:54:06Z This is the accepted answer. Both gcc and base-devel are installed. Browse other questions tagged c apache shell gcc compiler-construction or ask your own question. check over here Das unerlaubte Kopieren sowie die unbefugte Weitergabe dieser Mail ist nicht gestattet.

Antonio Vasconcelos replied Feb 16, 2012 Yes, we already have RPM, yum maybe next, ehehehhehe. asked 2 years ago viewed 739 times Related 114Why does flowing off the end of a non-void function without returning a value not produce a compiler error?1Why do I get “configure:error: You signed in with another tab or window.