Home > C Compiler > C Compiler Cannot Create Executables In Ubuntu

C Compiler Cannot Create Executables In Ubuntu

Contents

In a company crossing multiple timezones, is it rude to send a co-worker a work email in the middle of the night? Teenage daughter refusing to go to school First Skills to Learn for Mountaineering Is "she don't" sometimes considered correct form? Not the answer you're looking for? Add-in salt to injury? http://cmptp.com/c-compiler/c-compiler-cannot-create-executables-ubuntu.html

If you cannot run that, then I concur with Michael Hampton, something is very badly broken. It was created by cpuminer configure 2.4.2, which was generated by GNU Autoconf 2.69. Browse other questions tagged c compiler-construction ubuntu-12.04 or ask your own question. Offline #4 2010-02-03 22:11:00 tavianator Member From: Waterloo, ON, Canada Registered: 2007-08-21 Posts: 858 Website Re: [SOLVED] configure: error: C compiler cannot create executables This is the offending line from config.loggcc:

Configure: Error: C Compiler Cannot Create Executables Linux

x86_64-unknown-linux-gnu checking target system type... Which movie series are referenced in XKCD comic 1568? COLLECT_GCC=gcc COLLECT_LTO_WRAPPER=/usr/lib/gcc/x86_64-linux-gnu/4.7/lto-wrapper Target: x86_64-linux-gnu Configured with: ../src/configure -v --with-pkgversion='Ubuntu/Linaro 4.7.2-2ubuntu1' -- with-bugurl=file:///usr/share/doc/gcc-4.7/README.Bugs --enable- languages=c,c++,go,fortran,objc,obj-c++ --prefix=/usr --program-suffix=-4.7 --enable-shared --enable-linker-build-id --with-system-zlib --libexecdir=/usr/lib --without-included-gettext --enable-threads=posix --with-gxx-include-dir=/usr/include/c++/4.7 --libdir=/usr/lib -- enable-nls --with-sysroot=/ --enable-clocale=gnu --enable-libstdcxx-debug --enable- libstdcxx-time=yes

Maybe he wants to set different build options. Browse other questions tagged linux-mint gcc wine or ask your own question. configure: error: in `/home/learner/builds/tuxmath/src/tuxmath_w_fonts-1.7.2': configure: error: C compiler cannot create executables See `config.log' for more details. ==> ERROR: Build Failed. Configure: Error: C Compiler Cannot Create Executables Centos 6 share|improve this answer answered Apr 23 '13 at 0:11 markgz 4,7061930 1 That was it!

Not the answer you're looking for? Configure: Error: C Compiler Cannot Create Executables Mac Browse other questions tagged ubuntu ruby gcc or ask your own question. Generally you will need root privilege with sudo only at the final step you install it in the system. ./configure make sudo make install According to config.log, you failed to build http://askubuntu.com/questions/492650/c-compiler-cannot-create-executables Were the Smurfs the first to smurf their smurfs?

Anyone know what it is? Configure: Exit 77 Thanks 12.04 12.10 bash gcc share|improve this question edited Nov 13 '13 at 7:04 asked Sep 19 '13 at 12:16 naka 2192511 I got this error when I mistakenly Try: sudo apt install libc6-dev [Edit: this produces similar symptoms, but wasn't the case here. So I tried: sudo apt install libc6-dev to install the latest C headers.

Configure: Error: C Compiler Cannot Create Executables Mac

more hot questions question feed about us tour help blog chat data legal privacy policy work here advertising info mobile contact us feedback Technology Life / Arts Culture / Recreation Science http://stackoverflow.com/questions/16158609/c-compiler-cannot-create-executables-in-ubuntu-12-04 I needed to add CFLAGS option --std=c99 to enable it to get past this check in the configure script: ./configure CC=gcc CFLAGS="--std=c99 -O3" share|improve this answer edited Jan 30 '14 at Configure: Error: C Compiler Cannot Create Executables Linux no checking for c++... C Compiler Cannot Create Executables Centos gcc: error: missing argument to ‘-march=’ COLLECT_GCC=gcc COLLECT_LTO_WRAPPER=/usr/lib/gcc/x86_64-linux-gnu/4.8/lto-wrapper Target: x86_64-linux-gnu Configured with: ../src/configure -v --with-pkgversion='Ubuntu/Linaro 4.8.1-10ubuntu9' --with-bugurl=file:///usr/share/doc/gcc-4.8/README.Bugs --enable-languages=c,c++,java,go,d,fortran,objc,obj-c++ --prefix=/usr --program-suffix=-4.8 --enable-shared --enable-linker-build-id --libexecdir=/usr/lib --without-included-gettext --enable-threads=posix --with-gxx-include-dir=/usr/include/c++/4.8 --libdir=/usr/lib --enable-nls --with-sysroot=/ --enable-clocale=gnu --enable-libstdcxx-debug

I've also run makepkg as root. this content This is free software; see the source for copying conditions. What exactly are sleeping stalls versus waiting-rooms, for airport layovers? yes checking for C compiler default output file name... Checking For C Compiler Default Output File Name

Following are the contents of the mentioned log file: [2013-09-19 17:15:58] ./configure current path: /home/nishant/.rvm/src/ruby-2.0.0-p247 command(4): ./configure --prefix=/home/nishant/.rvm/rubies/ruby-2.0.0-p247 --disable-install-doc --enable-shared checking build system type... Why does Friedberg say that the role of the determinant is less central than in former times? Which movie series are referenced in XKCD comic 1568? http://cmptp.com/c-compiler/c-compiler-cannot-create-executables-ubuntu-12-04.html Teenage daughter refusing to go to school The nth numerator Is "she don't" sometimes considered correct form?

Can one bake a cake with a cooked egg instead of a raw one? C Compiler Cannot Create Executables Cross Compile gcc checking whether the C compiler works... Solutions?

Probability of All Combinations of Given Events Does トイレ refer to the British "toilet" or the American "toilet"?

How did your system get into its current state? –Michael Hampton♦ Mar 7 '14 at 13:53 Question edited as per your concern.... –Pradeep Gupta Mar 7 '14 at 13:58 In addition, #-- specify a space-delimited list of hosts running in the DistCC cluster. #DISTCC_HOSTS="" ######################################################################### # GLOBAL PACKAGE OPTIONS # These are default values for the options=() settings ######################################################################### # After that i removed default gdb(/usr/bin) using the following command sudo apt-get remove gdb Now, when try to configure i am getting following errors: checking whether the C compiler works... Install A 32 Bit Compiler Toolchain configure:3311: $? = 4 configure:3331: checking whether the C compiler works configure:3353: gcc conftest.c >&5 /usr/bin/ld: cannot find crt1.o: No such file or directory /usr/bin/ld: cannot find crti.o: No such file

Valid: md5, sha1, sha256, sha384, sha512 INTEGRITY_CHECK=(md5) #-- Manual (man and info) directories to compress (if zipman is specified) MAN_DIRS=({usr{,/local}{,/share},opt/*}/{man,info}) #-- Doc directories to remove (if !docs is specified) DOC_DIRS=(usr/{,local/}{,share/}{doc,gtk-doc} opt/*/{doc,gtk-doc}) I am trying to build Ruby from source as describe here: https://www.ruby-lang.org/en/installation/#building-from-source Here what i am getting: [email protected]:~/ruby-2.1.1$ ./configure checking build system type... no configure: error: in `/tmp/ruby-build.20140701130345.8077/ruby-2.1.2': configure: error: C compiler cannot create executables See `config.log' for more details lgs commented Jul 1, 2014 For some reasons my Ubuntu platform were missing some check over here Good job spotting the problem, but the recommended resolution is not to change the PATH but to either remove or fix that broken /usr/local/bin/ld. –Gilles Sep 19 '13 at 12:40

no checking for KCC... Is it unethical to poorly translate an exam from Dutch to English and then present it to the English speaking students? You can fix it, but really, look for a later version of the package which has been fixed.