Home > C Compiler > C Compiler Cannot Create Executables Opensuse

C Compiler Cannot Create Executables Opensuse

Contents

no checking for CC... I will have this thread under surveillance just in case someone answers this question... Thanks 12.04 12.10 bash gcc share|improve this question edited Nov 13 '13 at 7:04 asked Sep 19 '13 at 12:16 naka 2192511 I got this error when I mistakenly Reply With Quote 02-Jul-2008,20:42 #2 ken_yap View Profile View Forum Posts View Blog Entries View Articles Flux Capacitor Penguin Join Date Jun 2008 Location UTC+10 Posts 9,936 Re: C compiler cannot his comment is here

Following are the contents of the mentioned log file: [2013-09-19 17:15:58] ./configure current path: /home/nishant/.rvm/src/ruby-2.0.0-p247 command(4): ./configure --prefix=/home/nishant/.rvm/rubies/ruby-2.0.0-p247 --disable-install-doc --enable-shared checking build system type... Best wishes, Huub Jwkeller Member Profile Send PM Gets Around Threads 16 Posts 46 3:13:27 PM PDT - Tue, Jul 10th 2012 Thanks, Huub Huub, Thank you for the input. Reply With Quote « Previous Thread | Next Thread » Bookmarks Bookmarks Digg del.icio.us StumbleUpon Google Facebook Twitter Posting Permissions You may not post new threads You may not post replies John Keller Jwkeller Member Profile Send PM Gets Around Threads 16 Posts 46 12:26:34 PM PDT - Mon, Jul 16th 2012 Still having problems. weblink

C Compiler Cannot Create Executables Linux

endif" should be "#endif" as in the 7/23 email that was send to you. Looks like there is a bug that has been updated in the development version, and that gets caught by some strict compilers (and not by others). I found the equivalent for that would be: zypper install -t pattern devel_C_C++ I also installed kernel-source and kernel-syms. Nylex View Public Profile View LQ Blog View Review Entries View HCL Entries Find More Posts by Nylex 05-04-2007, 08:23 PM #3 mirex LQ Newbie Registered: May 2007 Posts:

Could someone please help. x86_64-unknown-linux-gnu checking for TARGET base (64bit-ness checked later)... I will have this thread under surveillance just in case someone answers this question... C Compiler Cannot Create Executables Cygwin no configure: error: in `/home/fobo66/xdebug-2.3.3': configure: error: C compiler cannot create executables See `config.log' for more details There is my config.log.

I've just reinstall glibc-devel with correct architecture. Hence it is likely to wrongly guess which compiler flags to use. Noha nmansour View Public Profile View LQ Blog View Review Entries View HCL Entries Find More Posts by nmansour 07-10-2008, 05:14 AM #10 inoitna LQ Newbie Registered: Jul http://askubuntu.com/questions/347466/configure-error-c-compiler-cannot-create-executables Add-in salt to injury?

This can probably be done with apt-get, but I'm not sure how you use it. C Compiler Cannot Create Executables Python How is it packed? i686-pc-linux-gnu checking target system type... asked 3 years ago viewed 102609 times active 1 month ago Linked 1 how to configure: error: C compiler cannot create executables 0 fribidi configure error Related 2.exe file created by

C Compiler Cannot Create Executables Mac

yes checking whether we are cross compiling... great post to read Join Date Nov 2009 Posts 2 C compiler cannot create executables Alright! C Compiler Cannot Create Executables Linux White ring of pus forming around branches Why didn’t Japan attack the West Coast of the United States during World War II? C Compiler Cannot Create Executables Ubuntu no configure: Detected VPATH build configure: configure: C compiler configure: checking for style of include used by make...

LinuxQuestions.org > Forums > Linux Forums > Linux - Newbie configure: error: C++ compiler cannot create executables User Name Remember Me? this content You will have to register before you can post in the forums. (Be aware the forums do not accept user names with a dash "-") Also, logging in lets you avoid If you'd like to contribute content, let us know. How to do it: Go to YaST Choose "Software Management" tool In a search field type glibc Mark packages glibc and glibc-devel for update (click on the checkboxes) Choose glibc package C Compiler Cannot Create Executables Centos

Here are the last 40 lines or so of make.log: ` .... Creating a table with FIXED length column widths I changed one method signature and broke 25,000 other classes. Also, double check what your $PATH is set to.Did this happen after a recent upgrade? http://cmptp.com/c-compiler/c-compiler-cannot-create-executables-on-mac.html The time now is 01:16 AM.

no configure: Detected VPATH build configure: configure: C compiler configure: checking for style of include used by make... C Compiler Cannot Create Executables Apache Therefore, the error does not depend on the hardware. If you need to reset your password, click here.

Topics: Active | Unanswered Index »Pacman & Package Upgrade Issues »[SOLVED] C compiler cannot create executables Pages: 1 #1 2010-11-18 06:57:52 colbert Member Registered: 2007-12-16 Posts: 809 [SOLVED] C compiler cannot

Introduction to Linux - A Hands on Guide This guide was created as an overview of the Linux Operating System, geared toward new users as an exploration tour and getting started Code: apt-get build-essential solved this issue for me. Note that registered members see fewer ads, and ContentLink is completely disabled once you log in. C Compiler Cannot Create Executables Linux Mint Send a Postcard! | Blog | PGP Key: F99FFE0FEAE999BD Offline #16 2010-11-19 00:44:44 colbert Member Registered: 2007-12-16 Posts: 809 Re: [SOLVED] C compiler cannot create executables You rock!

You need to install the gcc-c++ package (while you're at it, install gcc as well if you haven't already). If something changed I can check but not sure what/how you referring to specifically.Hmmm as for tmp dir, all I have is in /etc/yaourtrc "TMPDIR="/tmp" and no probs so far with Error: Unclassifiable statement at (1) DMatrix-mpi.F:1373.5: > MPI_DOUBLE_PRECISION,MPI_SUM, 1 Error: Non-numeric character in statement label at (1) DMatrix-mpi.F:1373.5: > MPI_DOUBLE_PRECISION,MPI_SUM, 1 Error: Unclassifiable statement at (1) DMatrix-mpi.F:1374.5: > MPI_COMM_WORLD,ierr) 1 Error: check over here make[3]: *** [optimized] Error 2 make[2]: *** [subdirs] Error 1 make[1]: *** [subdirs] Error 1 make: *** [libraries] Error 1 ` Edited On 2:38:26 PM PDT - Thu, Aug

So the directory would have to be something like nwchem-6.1.1 or nwchem-6.1.1-john. x86_64-suse-linux-gnu On 1941 Dec 7, could Japan have destroyed the Panama Canal instead of Pearl Harbor in a surprise attack? yes checking for gcc...

Can I send the make.log and config.log files to try and glean a clue about what to do next?