Home > C Compiler > C Compiler Cannot Create Executables Os X Ruby

C Compiler Cannot Create Executables Os X Ruby

Contents

Stop. ``` エラーログは変わったけどまだ駄目。 ぐぐったらopensslが必要って言うのを見つけたのでインストールする ※ これに意味があったのかどうかは今となっては不明 ``` $ brew install openssl ==> Downloading http://www.openssl.org/source/openssl-1.0.1f.tar.gz ######################################################################## 100.0% ==> perl ./Configure --prefix=/usr/local/Cellar/openssl/1.0.1f --openssldir=/usr/local/etc/openssl zlib-dynamic shared darwin64-x86_64-cc enable-ec_nistp_64_gcc_128 ==> make depend ==> make ==> awk checking whether make sets $(MAKE)... i686-apple-darwin13.0.0 checking target system type... Note that this is the version installed by homebrew and that this version is different from the gcc-4.2 version reported in the logs above. his comment is here

[email protected] Library (master) $ git commit -a -m "Switch to \"Current\" Ruby framework symlink" [master 7676006] Switch to "Current" Ruby framework symlink 1 file changed, 1 insertion(+), 1 deletion(-) [email protected] Library Unfortunately, upgrading to OS X Yosemite might break it, as it did for me. no checking for awk... How to make plots 'blacker'? http://stackoverflow.com/questions/10357804/configure-error-c-compiler-cannot-create-executables

Configure: Error: C Compiler Cannot Create Executables Linux

Tank-Fighting Alien Am I interrupting my husband's parenting? I just finished week two and I am liking th... I showed you that the C compiler is installed correctly on my machine. Personal Open source Business Explore Sign up Sign in Pricing Blog Support Search GitHub This repository Watch 294 Star 8,785 Fork 813 rbenv/rbenv Code Issues 36 Pull requests 14 Projects

You can also install the newest version of Xcode through the App store. But I have this error: BUILD FAILED Inspect or clean up the working tree at /var/folders/fn/1kz6tqdd2b58vl6lggn7ks4r0000gn/T/ruby-build.20130901135911.4559 Results logged to /var/folders/fn/1kz6tqdd2b58vl6lggn7ks4r0000gn/T/ruby-build.20130901135911.4559.log Last 10 log lines: checking build system type... The answer by steroscott fixed my issue a while back...this time around not the case. Configure: Error: C Compiler Cannot Create Executables Centos jacknagel commented Sep 14, 2014 I have no cc under /usr/bin/.

DETAILS: Apple no longer includes the official GCC compiler with Xcode as of version 4.2. Mac Configure: Error: C Compiler Cannot Create Executables no checking for nawk... Here is the output of env jacknagel commented Sep 9, 2014 Can you think of anything else on your system that could affect the environment when brew is executed? Already have an account?

In my case rvm is trying to use a downloaded gcc via homebrew. Install A 32 Bit Compiler Toolchain And I've put the config.log into a gist at https://gist.github.com/1177039 (includes "brew doctor" output as well) ==> Upgrading imagemagick ==> Downloading https://github.com/trevor/ImageMagick/tarball/6.7.1-1 File already downloaded in /Users/mkoby/Library/Caches/Homebrew ==> ./configure --disable-osx-universal-binary --without-perl no checking for nawk... In my .bash_profile file I had: export ARM_ARCH="arm64” export CFLAGS="-arch ${ARM_ARCH}" As you can observe --- export ARM_ARCH="arm64” --- the last quote sign is not the same with the first quote

Mac Configure: Error: C Compiler Cannot Create Executables

Depalindromize this string! http://superuser.com/questions/759363/upgraded-to-mavericks-c-compiler-cannot-create-executables no configure: error: in `/var/folders/sv/0m72rddx6_39qr64ygd7msx40000gn/T/ruby-build.20140112223317.5732/ruby-1.8.7-p370': configure: error: C compiler cannot create executables See `config.log' for more details. Configure: Error: C Compiler Cannot Create Executables Linux Please enable JavaScript to view the comments powered by Disqus. Configure Error C Compiler Cannot Create Executables Ubuntu Without opening the PHB, is there a way to know if it's a particular printing?

i686-apple-darwin13.0.0 checking target system type... this content Having some experience with Linux (Ubuntu and such), I expected OS X to bake in package management system, like apt-get, RPM, or yum. is that even a thing I can do?) Many solutions mention accepting an XCode license agreement, which I have done, and the problem persists. What to do?? Checking Whether The C Compiler Works... No Mac

Creating a table with FIXED length column widths more hot questions question feed about us tour help blog chat data legal privacy policy work here advertising info mobile contact us feedback So first install the command line tools then see the answer below by @sterescott and that should take care of your problems. But don't feel obligated :) jacknagel closed this Sep 17, 2014 jacknagel referenced this issue Oct 21, 2014 Closed rtorrent failed to build on 10.10 #33446 shahzadsultan commented Jan 20, 2015 http://cmptp.com/c-compiler/c-compiler-cannot-create-executables-on-mac.html i686-apple-darwin13.0.0 checking target system type...

config/install-sh -c -d checking for gawk... Checking For C Compiler Default Output File Name yes checking for a thread-safe mkdir -p... ./install-sh -c -d checking for gawk... Qiita投稿MacMac(Mavericks)にRuby1.8.7を入れようとしたら大変だった話Mac3801Ruby11806takc923が2014/01/13に投稿問題がある投稿を報告する×問題がある投稿を報告するこの投稿にどのような問題がありますか? スパムです 攻撃的または迷惑な内容を含んでいます 不適切な内容を含んでいます 送信17ストック0コメントストックストック済み解除 この記事は最終更新日から1年以上が経過しています。今更Ruby1.8.7かよ的な空気もありつつちょっと試したいことがあったのでインストールしようとしたら割りと大変だったので記録を残しておく。 rbenvはインストール済み、という前提。 素直に1.8.7系をインストールしようとすると、こうなった $ rbenv install 1.8.7-p374 Configured with: --prefix=/Applications/Xcode.app/Contents/Developer/usr --with-gxx-include-dir=/usr/include/c++/4.2.1 ERROR: This package must be compiled with GCC, but ruby-build couldn't find a suitable `gcc`

no configure: error: in `/var/folders/sv/0m72rddx6_39qr64ygd7msx40000gn/T/ruby-build.20140112223317.5732/ruby-1.8.7-p370': configure: error: C compiler cannot create executables See `config.log' for more details.

BUILD FAILED Inspect or clean up the working tree at /var/folders/sv/0m72rddx6_39qr64ygd7msx40000gn/T/ruby-build.20140112221410.79997 Results logged to /var/folders/sv/0m72rddx6_39qr64ygd7msx40000gn/T/ruby-build.20140112221410.79997.log Last 10 log lines: x ruby-1.8.7-p374/configure x ruby-1.8.7-p374/parse.c /var/folders/sv/0m72rddx6_39qr64ygd7msx40000gn/T/ruby-build.20140112221410.79997/ruby-1.8.7-p374 /var/folders/sv/0m72rddx6_39qr64ygd7msx40000gn/T/ruby-build.20140112221410.79997 ~/Workspace/gyazo-sinatra checking build system type... no configure: error: in `/Users/abhi/Downloads/httpd-2.4.17': configure: error: C compiler cannot create executables See `config.log' for more details Why can't the C compiler create executable? Mac OS X already provides this software and installing another version in parallel can cause all kinds of trouble. See `config.log' For More Details no configure: error: in `/private/tmp/xz-ms6a/xz-5.0.5': configure: error: C compiler cannot create executables See `config.log' for more details Error: Homebrew doesn't know what compiler versions ship with your version of Xcode (6.1).

no checking for mawk... Personal Open source Business Explore Sign up Sign in Pricing Blog Support Search GitHub This repository Watch 1,053 Star 29,490 Fork 14,007 Homebrew/legacy-homebrew Code Issues 1 Pull requests 0 Projects Instead I had: /Applications/Xcode.app/Contents/Developer/Toolchains/XcodeDefault.xctoolchain The C compiler ("cc") is located inside of that xctoolchain directory. check over here i686-apple-darwin13.0.0 checking host system type...

Join them; it only takes a minute: Sign up Here's how it works: Anybody can ask a question Anybody can answer The best answers are voted up and rise to the I'm not sure what else to do. replicate the change from https://github.com/Homebrew/homebrew/commit/1bbcc4b5110f5a0573dfc78175d05fe454bbbda0 .... Rather than reinstall Xcode, I noticed there were two relevant lines in my config.log: configure:5130: checking for C compiler version configure:5139: /Applications/Xcode.app/Contents/Developer/Toolchains/OSX10.8.xctoolchain/usr/bin/cc --version >&5 That path did not exist for me.

i686-apple-darwin13.0.0 checking target system type... no configure: error: in /private/tmp/homebrew-gettext-0.18.1.1-8MVa/gettext-0.18.1.1/gettext-runtime': configure: error: C compiler cannot create executables Seeconfig.log' for more details. Is it possible to bleed brakes without using floor jack? share|improve this answer answered Sep 27 '14 at 17:29 C-Rock 1 add a comment| up vote 0 down vote Make sure there are no spaces in your Xcode application name (can

The Command Line Tools for Xcode package only includes `llvm-gcc`. Generally there are no consequences of this for you. I've reinstalled Xcode as was recommended in a couple places, but no dice. First Skills to Learn for Mountaineering What is the total sum of the cardinalities of all subsets of a set?

Going back to my previous comment, why do I have /usr/local/Library/ENV/4.3/gcc-4.2 installed?