Home > C Compiler > C Compiler Cannot Create Executables Php

C Compiler Cannot Create Executables Php

Contents

gcc checking for C compiler default output file name... I am doing what I have always done, logged in as my user and entering root pass when asked with yaourt/pacman. configure:6156: $? = 1 configure: failed program was: | /* confdefs.h */ | #define PACKAGE_NAME "" | #define PACKAGE_TARNAME "" | #define PACKAGE_VERSION "" | #define PACKAGE_STRING "" | #define PACKAGE_BUGREPORT So the error message doesn't explain the exact error. –RajaRaviVarma Dec 5 '13 at 16:31 add a comment| 2 Answers 2 active oldest votes up vote 10 down vote accepted It his comment is here

Why don't we use the étale definition of sheaves in Algebraic Geometry Could I work as a Professor in Europe if I only speak English? configure: error: C compiler cant create executables PDA View Full Version : Please help me. no checking for mawk... no Checking for jpeglib.h ...

C Compiler Cannot Create Executables Linux

done Writing etc/system.rootdaemonrc ... i686-pc-linux-gnulibc1 checking host system type... Not the answer you're looking for?

Topics: Active | Unanswered Index »Pacman & Package Upgrade Issues »[SOLVED] C compiler cannot create executables Pages: 1 #1 2010-11-18 06:57:52 colbert Member Registered: 2007-12-16 Posts: 809 [SOLVED] C compiler cannot no Checking for libmisc ... Seems very valid to me! –Andy Dent Jun 7 '12 at 22:41 | show 5 more comments 11 Answers 11 active oldest votes up vote 91 down vote accepted You have Checking For C Compiler Default Output File Name no Checking for libpq-fe.h ...

Mysterious creeper-like explosions One Very Odd Email How do I reverse this javascript code? C Compiler Cannot Create Executables Mac The time now is 23:19. © 2015 SUSE, All Rights Reserved. no Checking whether to build libGdml ... http://askubuntu.com/questions/647583/how-to-fix-configure-error-c-compiler-cannot-create-executables done Writing etc/daemons/proofd.xinetd ...

config.log output: This file contains any messages produced by compilers while running configure, to aid debugging if configure makes a mistake. Checking Whether The C Compiler Works... No Mac no Checking whether to build included libAfterImage ... In a company crossing multiple timezones, is it rude to send a co-worker a work email in the middle of the night? Following are the contents of the mentioned log file: [2013-09-19 17:15:58] ./configure current path: /home/nishant/.rvm/src/ruby-2.0.0-p247 command(4): ./configure --prefix=/home/nishant/.rvm/rubies/ruby-2.0.0-p247 --disable-install-doc --enable-shared checking build system type...

C Compiler Cannot Create Executables Mac

The CFLAGS answers appear to be correct.] share|improve this answer edited Jul 13 '15 at 17:44 answered Jul 12 '15 at 17:19 Colin Watson 4,46511021 libc6-dev is already the How small could an animal be before it is consciously aware of the effects of quantum mechanics? C Compiler Cannot Create Executables Linux asked 3 years ago viewed 34596 times active 2 years ago Visit Chat Linked 1 configuration error in RVM Related 3Dealing with “C compiler cannot create executables” in Cygwin2C Compiler cannot C Compiler Cannot Create Executables Ubuntu There is NO warranty; not even for MERCHANTABILITY or FITNESS FOR A PARTICULAR PURPOSE.

Invocation command line was $ ./configure --prefix=/opt/myapp/apache2.2 --with-mpm=worker --enable-static-support --enable-ssl=static --enable-modules=most --disable-authndbd --disable-authn-dbm --disable-dbd --enable-static-logresolve --enable-static-rotatelogs --enable-proxy=static --enable-proxyconnect=static --enable-proxy-ftp=static --enable-proxy-http=static --enable-rewrite=static --enable-so=static --with-ssl=/opt/myapp/apache2.2/openssl --host=x86_32-unknown-linux-gnu host_alias=x86_32-unknown-linux-gnu CFLAGS=-m32 LDFLAGS=-m32 --with-included-apr ## --------- ## this content Join them; it only takes a minute: Sign up Here's how it works: Anybody can ask a question Anybody can answer The best answers are voted up and rise to the no Checking for libiodbc, libodbc, or odbc32 ... Join them; it only takes a minute: Sign up configure: error: C compiler cannot create executables up vote 106 down vote favorite 23 I've checked a number of similar questions on C Compiler Cannot Create Executables Centos

no configure: error: in `/home/nishant/.rvm/src/ruby-2.0.0-p247': configure: error: C compiler cannot create executables See `config.log' for more details I then tried a "hello world" C program and got the following error on If this is your first visit, be sure to check out the FAQ. Please post bug reports in Jira. http://cmptp.com/c-compiler/c-compiler-cannot-create-executables-on-mac.html no Checking for libchirp_client ...

COLLECT_GCC=gcc COLLECT_LTO_WRAPPER=/usr/lib/gcc/i686-linux-gnu/4.8/lto-wrapper Target: i686-linux-gnu Configured with: ../src/configure -v --with-pkgversion='Ubuntu 4.8.4-2ubuntu1~1$ Thread model: posix gcc version 4.8.4 (Ubuntu 4.8.4-2ubuntu1~14.04) configure:3436: $? = 0 configure:3425: gcc -V >&5 gcc: error: unrecognized command line Install A 32 Bit Compiler Toolchain asked 1 year ago viewed 30257 times active 7 months ago Related 11How to speed up compilation of Ubuntu apps (make, cmake, gcc)1./configure error when compiling xgrafix on ubuntu 12.041cross compiling I've alredy install cpp cpp-2.95 cpp-3.3 cpp-3.4 cpp-4.0 gcc gcc272 gcc-2.95 gcc-3.3 gcc-3.3 base gcc-3.4 gcc-3.4 base gcc-4.0 gcc-4.0 base libgcc1 libgcj6 libgcj6-common Thanks for answer gondilonMay 14th, 2006, 02:45 PMtry

I ran a brew uninstall of gcc (gcc46 for me) and reran the code for the ruby installation (old project old ruby v) $ brew uninstall gcc46 $ rvm install 1.9.3

gfortran Checking for libX11 ... /usr/lib Checking for X11/Xlib.h ... /usr/include Checking for X11/Xft/Xft.h ... /usr/include Checking for X11/extensions/shape.h ... /usr/include Checking for libXpm ... /usr/lib Checking for libXft ... /usr/lib Teenage daughter refusing to go to school Singular cohomology and birational equivalence Newton's second law for individual forces Was there no tax before 1913 in the United States? Rather than reinstall Xcode, I noticed there were two relevant lines in my config.log: configure:5130: checking for C compiler version configure:5139: /Applications/Xcode.app/Contents/Developer/Toolchains/OSX10.8.xctoolchain/usr/bin/cc --version >&5 That path did not exist for me. C Compiler Cannot Create Executables Cross Compile To build older versions of Ruby you must have the official GCC compiler installed on your system.

done Writing build/misc/root-help.el ... Invocation command line was $ ./configure ## --------- ## ## Platform. ## ## --------- ## hostname = delta uname -m = i686 uname -r = 2.6.12-10-386 uname -s = Linux uname i686-pc-linux-gnu checking host system type... check over here configure: error: C compiler cant create executables bentinoMay 14th, 2006, 12:04 PMI'm install sqlite3 when input command $ ../sqlite-3.3.5/configure it's show checking build system type...

thanks for the fix –Mike O Jul 12 '15 at 20:18 add a comment| up vote 2 down vote My guess would be that you have the basic C compiler installed, make: *** [setup] Error 77 Aborting... ==> ERROR: Makepkg was unable to build freetype2-infinality.I reinstalled base-devel although all were already installed, same thing. The solution I used was the same as Mostafa, I had to export 2 variables: export CC=/Applications/Xcode.app/Contents/Developer/Toolchains/XcodeDefault.xctoolchain/usr/bin/cc CPP='/Applications/Xcode.app/Contents/Developer/Toolchains/XcodeDefault.xctoolchain/usr/bin/cc -E' This was one Mac OSX Mavericks share|improve this answer answered Dec 20 Franck. ----------------------------------------------------------------------- This file contains any messages produced by compilers while running configure, to aid debugging if configure makes a mistake.

It was created by cpuminer configure 2.4.2, which was generated by GNU Autoconf 2.69. What should I do when the boss "pulls rank" to get their problems solved over our customers' problems? configure:6156: $? = 1 configure: failed program was: | /* confdefs.h */ | #define PACKAGE_NAME "" | #define PACKAGE_TARNAME "" | #define PACKAGE_VERSION "" | #define PACKAGE_STRING "" | #define PACKAGE_BUGREPORT Arrêt.

Unix & Linux Stack Exchange works best with JavaScript enabled Arch Linux HomePackagesForumsWikiBugsAURDownload Index Rules Search Register Login You are not logged in. So maybe you could have a look there. What is really curved, spacetime, or simply the coordinate lines? i686-pc-linux-gnulibc1 checking for gcc...

The first one ( " ) is legal while the second one ( ” ) is not. yes checking whether to enable maintainer-specific portions of Makefiles... done Writing config/Makefile.comp ... Do students wear muggle clothing while not in classes at Hogwarts (like they do in the films)?