Home > Cannot Open > C1 Fatal Error C1083 Cannot Open Source File Permission Denied

C1 Fatal Error C1083 Cannot Open Source File Permission Denied

Contents

Please click the link in the confirmation email to activate your subscription. Back to top #4 magic_man Members -Reputation: 54 Like 0Likes Like Posted 07 March 2009 - 03:27 AM Strange it seems you inherit full control for files and sub directories It should be 'C:\Qt\3.3.5\include' Check where is this defined and correct it. Why is this C++ code faster than my hand-written assembly for testing the Collatz conjecture? weblink

Please turn JavaScript back on and reload this page. Community of RTI Data Distribution Service Users. Submitted by vishal on Thu, 01/17/2013 - 11:43 Note: Applies to RTI Connext 4.x and above.When using Visual Studio to build the project files generated by rtiddsgen, you may see the Please help. https://social.msdn.microsoft.com/Forums/vstudio/en-US/7f4fb0d7-419e-400c-93cf-292c5bc8b322/c1083-permission-denied?forum=vclanguage

Fatal Error C1083 Cannot Open Compiler Generated File Permission Denied

Instead, build each application separately.Configure Visual Studio to set the maximum number of parallel builds to one (1): Select Tools, Options. Visual Studio cannot eat it's own dogfood and if it has a macro in an include dir that isn't defined the error will flow on to other areas without being detected, Whats the problem here!? The double backlashes seem to be the problem.

Like Show 0 Likes(0) Actions 2. For some reason I'm getting a fatal error while trying to compile my code. this is what I get sometimes: c1xx : fatal error C1083: Cannot open source file: 'C:\Qt\3.3.5/include': Permission denied it happens some times and when it happens the only solution seems to Cannot Open Compiler Generated File Obj the conversion process from vs6 dsp to vs8 vcproj stuck in an extra "/I /I ($QTDIR)/include" in the advaced c++ command line options in the project settings - this is what

The generated sample solutions contain two projects that use common files. Not the answer you're looking for? Brian Wednesday, August 30, 2006 2:36 PM Reply | Quote Moderator 3 Sign in to vote I had this error too, and (if that can help someone else) the problem was http://stackoverflow.com/questions/13817374/fatal-error-c1083-cannot-open-compiler-intermediate-file-pch-no-such-fi Any furthere suggestions on how to fix this error.

In the Options dialog, expand Projects and Solutions, select Build and Run. I can reproduce the error myself with: #include "c:\qt\include\qt"

e:\tempprojects\qt\qt\qt.cpp(6) : fatal error C1083: Cannot open include file: 'c:\qt\include\qt': Permission denied The following works fine:

#include "c:\qt\include\qt\qvector.h"

Furthermore, if I add Message Insert Code Snippet Alt+I Code Inline Code Link H1 H2 Preview Submit your Reply Alt+S Ask a Different Software Development Question Related Articles Linker Fatal Error!! 12 replies Hi, I How do I sort files into a sub-folder based on filename part?

Fatal Error C1083 Cannot Open Compiler Generated File No Such File Or Directory

more stack exchange communities company blog Stack Exchange Inbox Reputation and Badges sign up log in tour help Tour Start here for a quick overview of the site Help Center Detailed https://forums.adobe.com/thread/2009607 How to make plots 'blacker'? Fatal Error C1083 Cannot Open Compiler Generated File Permission Denied more stack exchange communities company blog Stack Exchange Inbox Reputation and Badges sign up log in tour help Tour Start here for a quick overview of the site Help Center Detailed Fatal Error C1083 Cannot Open Compiler Generated File Invalid Argument In your last post, you appear to be trying to compile or include a directory, not a file.

Here is the text: 1>c1xx : fatal error C1083: Cannot open source file: 'C:\Documents and Settings\Alix\My Documents\genetic context\GSL\include': Permission denied I was having the same error with visual studio 2003, then have a peek at these guys I downloaded qt and configured it (mostly anyway). both are showing the following error, [B]LINK : fatal error LNK1104: cannot open file 'kernel32.lib'[/B] I … Recommended Articles FORTRAN: Can Program Execution Jump Sub-routine? Maybe you have a backslash that is intended as an escape character, but is being interpreted as literal. Vb6 Fatal Error C1083 Cannot Open Compiler Generated File

So I am not sure why this project does not work. I entered the include path and when building it tells me :fatal error C1083: Include-Datei kann nicht geöffnet werden: 'c:\Qt\4.1.2\include\': Permission deniedAny ideas? Does sputtering butter mean that water is present? check over here How is it packed?

Let me … fatal error error LNK2019 2 replies I am trying to run this program, in this I have a class clocktype with its header file and implementation file. It is common for instances of the compiler to attempt to reference the same file at the same time.To avoid running into this problem, you can do one of the following share|improve this answer answered Jul 16 '15 at 14:19 Naudy 12 add a comment| Your Answer draft saved draft discarded Sign up or log in Sign up using Google Sign

All rights reserved.

Wednesday, April 05, 2006 6:52 PM Reply | Quote 0 Sign in to vote Here is the output of cacls :C:\Documents and Settings\Alix>cacls "My Documents\genetic context\GSL\include"C:\Documents and Settings\Alix\My Documents\genetic context\GSL\include PC240882351225\Alix:F                                                                        share|improve this answer answered Jun 4 '13 at 9:43 Panda 8661321 add a comment| up vote 0 down vote Try turning off the precompiled headers on your project settings and then Are “Referendum” and “Plebiscite” the same in the meaning, or different in the meaning and nuance? This error usually occurs when the project is set up to use precompiled headers (PCHs), but the one source file creating PCHs wasn't compiled yet (or setting it up to create

I'm working on a coordinate ... Nether_1 17 posts since May 2016 Community Member Nested array printing etc - designing for reuse Last Post 19 Hours Ago This is a little discussion/example of design for modularity and Is it possible to bleed brakes without using floor jack? this content I now need to figure out on how to get rid of the "\\" 0 Discussion Starter Luks -2 6 Years Ago I have worked on resetting the path, and one

So, my guess is that when VS2005 did the macro substitution, it was empty (no other characters in the include directory path) and it tried to compile the following include directory Wednesday, April 05, 2006 6:56 PM Reply | Quote 0 Sign in to vote I am having the same problem. c++ visual-studio-2008 visual-c++ share|improve this question edited Dec 11 '12 at 10:13 sashoalm 19.3k32153329 asked Dec 11 '12 at 9:38 lntan 1113 So how does you TMP environment variable Now I am trying … error LNK2001: unresolved external symbol 2 replies Hi guys!

Mysterious creeper-like explosions Add comments to a python script and make it a bilingual python/C++ “program” Looking for a nice example for normal subgroups Why do I never get a mention How is it packed? But you have one slash before everything else and two there. 0 Discussion Starter Luks -2 6 Years Ago Thanks for you responses. it's supposed to be a simple loan calculator i had to fix, but i can't get it to work. … B-Tree Implementation - Fatal Error 1 reply Hey all.

check the same by following the path: Right click on the solution->Properties->C++->General Two ways to Solve: Suppose the variable defined is AX create a batch file set AX="path of your include So i removed it and added the /Bd and since then it hasn't happened (i am still following to make sure).btw I found this site that has other compiler undocumented settings Search Search Secondary menuRTI.com RTI Blog RTI Github OMG DDS Portal You are hereHome » Knowledge Base » Solutions Navigation Forums Knowledge BaseBest Practices Case + Code Examples HOWTOs SolutionsWhy do First Skills to Learn for Mountaineering Looking for a nice example for normal subgroups I changed one method signature and broke 25,000 other classes.

sorry.just tried it and ran a compilation and immediatly got the:c1xx : fatal error C1083: Cannot open source file: 'C:\Qt\3.3.5/include': Permission deniedI still think it is a problem in dev studio JamesCherrill 2,739 12,954 posts since Apr 2008 Moderator Featured More Recommended Articles About Us Contact Us Donate Advertising Vendor Program Terms of Service Newsletter Archive Community Forums Recent Articles © 2002 Wait... Not the answer you're looking for?

I'm banking on #1. Many thanks for any suggestions, visual-studio-2008 share|improve this question asked Mar 8 '10 at 11:05 ant2009 92186250399 add a comment| 2 Answers 2 active oldest votes up vote 1 down vote